Target
Trypsin-2
Ligand
BDBM50067887
Substrate
Meas. Tech.
ChEMBL_41517 (CHEMBL656498)
IC50
>200000±n/a nM
Citation
 Weston, GSBlázquez, JBaquero, FShoichet, BK Structure-based enhancement of boronic acid-based inhibitors of AmpC beta-lactamase. J Med Chem 41:4577-86 (1998)  
Target
Name:
Trypsin-2
Synonyms:
Anionic trypsinogen Serine protease 2 TRY2_HUMAN Thrombin & trypsin Trypsin II | Trypsin-2
Type:
PROTEIN
Mol. Mass.:
26479.43
Organism:
Homo sapiens (Human)
Description:
ChEMBL_41517
Residue:
247
  
Inhibitor
Name:
BDBM50067887
Synonyms:
3-NITROPHENYLBORONIC ACID 3-Nitrophenyl boronic acid CHEMBL20945 | m-nitophenyl boronic acid
Type:
Small organic molecule
Emp. Form.:
C6H6BNO4
Mol. Mass.:
166.927
SMILES:
O[B-](=[OH+])c1cccc(c1)[N+]([O-])=O
: