Target
M-phase inducer phosphatase 1
Ligand
BDBM50068034
Substrate
Meas. Tech.
ChEMBL_40087 (CHEMBL655756)
IC50
24200±n/a nM
Citation
 Peng, HZalkow, LHAbraham, RTPowis, G Novel CDC25A phosphatase inhibitors from pyrolysis of 3-alpha-azido-B-homo-6-oxa-4-cholesten-7-one on silica gel. J Med Chem 41:4677-80 (1998)  
Target
Name:
M-phase inducer phosphatase 1
Synonyms:
CDC25A Dual specificity phosphatase Cdc25A MPIP1_HUMAN | phosphatase Cdc25
Type:
Protein
Mol. Mass.:
59090.18
Organism:
Homo sapiens (Human)
Description:
P30304
Residue:
524
  
Inhibitor
Name:
BDBM50068034
Synonyms:
CHEMBL344058 [5-(5-Cyano-1-methyl-penta-1,4-dienyl)-1-(1,5-dimethyl-hexyl)-7a-methyl-octahydro-inden-4-yl]-acetic acid
Type:
Small organic molecule
Emp. Form.:
C27H43NO2
Mol. Mass.:
413.6358
SMILES:
CC(C)CCCC(C)[C@H]1CC[C@H]2[C@H](CC(O)=O)[C@H](CC[C@]12C)C(\C)=C\C\C=C/C#N
: