Target
Receptor-interacting serine/threonine-protein kinase 1
Ligand
BDBM50513024
Substrate
Meas. Tech.
ChEMBL_1851532 (CHEMBL4352156)
IC50
1.6±n/a nM
Citation
 Harris, PAFaucher, NGeorge, NEidam, PMKing, BWWhite, GVAnderson, NABandyopadhyay, DBeal, AMBeneton, VBerger, SBCampobasso, NCampos, SCapriotti, CACox, JADaugan, ADonche, FFouchet, MHFinger, JNGeddes, BGough, PJGrondin, PHoffman, BLHoffman, SJHutchinson, SEJeong, JUJigorel, ELamoureux, PLeister, LKLich, JDMahajan, MKMeslamani, JMosley, JENagilla, RNassau, PMNg, SLOuellette, MTPasikanti, KKPotvain, FReilly, MARivera, EJSautet, SSchaeffer, MCSehon, CASun, HThorpe, JHTotoritis, RDWard, PWellaway, NWisnoski, DDWoolven, JMBertin, JMarquis, RW Discovery and Lead-Optimization of 4,5-Dihydropyrazoles as Mono-Kinase Selective, Orally Bioavailable and Efficacious Inhibitors of Receptor Interacting Protein 1 (RIP1) Kinase. J Med Chem 62:5096-5110 (2019)  
Target
Name:
Receptor-interacting serine/threonine-protein kinase 1
Synonyms:
Cell death protein RIP RIP-1 RIPK1 Receptor-interacting protein 1
Type:
Enzyme Catalytic Domain
Mol. Mass.:
75926.99
Organism:
Homo sapiens (Human)
Description:
Q13546
Residue:
671
  
Inhibitor
Name:
BDBM50513024
Synonyms:
CHEMBL4471642
Type:
Small organic molecule
Emp. Form.:
C16H20N2O
Mol. Mass.:
256.3428
SMILES:
O=C(C1CCCCC1)N1N=CCC1c1ccccc1
: