Target
Sigma non-opioid intracellular receptor 1
Ligand
BDBM50068432
Substrate
Meas. Tech.
ChEMBL_200964 (CHEMBL802052)
Ki
0.72±n/a nM
Citation
 Zhang, YWilliams, WTorrence-Campbell, CBowen, WDRice, KC Characterization of novel N,N'-disubstituted piperazines as sigma receptor ligands. J Med Chem 41:4950-7 (1999)  
Target
Name:
Sigma non-opioid intracellular receptor 1
Synonyms:
Aging-associated gene 8 protein SGMR1_HUMAN SIGMAR1 SR31747-binding protein Sigma 1-type opioid receptor Sigma1R | hSigmaR1
Type:
Enzyme Catalytic Domain
Mol. Mass.:
25124.85
Organism:
Homo sapiens (Human)
Description:
Q99720
Residue:
223
  
Inhibitor
Name:
BDBM50068432
Synonyms:
1-[2-(3-Nitro-phenyl)-ethyl]-4-(3-phenyl-propyl)-piperazine | CHEMBL144741
Type:
Small organic molecule
Emp. Form.:
C21H27N3O2
Mol. Mass.:
353.458
SMILES:
[O-][N+](=O)c1cccc(CCN2CCN(CCCc3ccccc3)CC2)c1
: