Target
Poly [ADP-ribose] polymerase 1
Ligand
BDBM50068770
Substrate
Meas. Tech.
ChEMBL_159664 (CHEMBL761792)
IC50
290±n/a nM
Citation
 Griffin, RJSrinivasan, SBowman, KCalvert, AHCurtin, NJNewell, DRPemberton, LCGolding, BT Resistance-modifying agents. 5. Synthesis and biological properties of quinazolinone inhibitors of the DNA repair enzyme poly(ADP-ribose) polymerase (PARP). J Med Chem 41:5247-56 (1999)  
Target
Name:
Poly [ADP-ribose] polymerase 1
Synonyms:
Adprp Adprt1 Parp1 Poly [ADP-ribose] polymerase-1
Type:
PROTEIN
Mol. Mass.:
113131.74
Organism:
Mus musculus
Description:
ChEMBL_159828
Residue:
1013
  
Inhibitor
Name:
BDBM50068770
Synonyms:
8-Hydroxy-2-(4-hydroxy-phenyl)-3H-quinazolin-4-one | CHEMBL127335
Type:
Small organic molecule
Emp. Form.:
C14H10N2O3
Mol. Mass.:
254.2408
SMILES:
Oc1ccc(cc1)-c1nc2c(O)cccc2c(=O)[nH]1
: