Target
Chymotrypsin-C
Ligand
BDBM50068918
Substrate
Meas. Tech.
ChEBML_49617
Ki
34±n/a nM
Citation
 Eda, MAshimori, AAkahoshi, FYoshimura, TInoue, YFukaya, CNakajima, MFukuyama, HImada, TTakai, SShiota, NMiyazaki, MNakamura, N Peptidyl human heart chymase inhibitors. 2. Discovery of highly selective difluoromethylene ketone derivatives with Glu at P3 site. Bioorg Med Chem Lett 8:919-24 (1999)  
Target
Name:
Chymotrypsin-C
Synonyms:
CLCR CTRC_HUMAN Chymotrypsin Chymotrypsin-C
Type:
Enzyme
Mol. Mass.:
29487.98
Organism:
Homo sapiens (Human)
Description:
Q99895
Residue:
268
  
Inhibitor
Name:
BDBM50068918
Synonyms:
(S)-4-((2S,3S)-2-Benzyloxycarbonylamino-3-methyl-pentanoylamino)-5-[(S)-2-((S)-1-methoxycarbonyl-2-phenyl-ethylcarbamoyl)-pyrrolidin-1-yl]-5-oxo-pentanoic acid | CHEMBL355430
Type:
Small organic molecule
Emp. Form.:
C34H44N4O9
Mol. Mass.:
652.7346
SMILES:
CC[C@H](C)[C@H](NC(=O)OCc1ccccc1)C(=O)N[C@@H](CCC(O)=O)C(=O)N1CCC[C@H]1C(=O)N[C@@H](Cc1ccccc1)C(=O)OC
: