Target
Chymase
Ligand
BDBM50068915
Substrate
Meas. Tech.
ChEBML_49443
Ki
6.7±n/a nM
Citation
 Eda, MAshimori, AAkahoshi, FYoshimura, TInoue, YFukaya, CNakajima, MFukuyama, HImada, TTakai, SShiota, NMiyazaki, MNakamura, N Peptidyl human heart chymase inhibitors. 2. Discovery of highly selective difluoromethylene ketone derivatives with Glu at P3 site. Bioorg Med Chem Lett 8:919-24 (1999)  
Target
Name:
Chymase
Synonyms:
Alpha-chymase CMA1_HUMAN CYM Mast cell protease I
Type:
Enzyme
Mol. Mass.:
27340.12
Organism:
Homo sapiens (Human)
Description:
Residue:
247
  
Inhibitor
Name:
BDBM50068915
Synonyms:
5-{(S)-2-[1-Benzyl-3-(3-carboxymethyl-phenylcarbamoyl)-3,3-difluoro-2-oxo-propylcarbamoyl]-pyrrolidin-1-yl}-4-tert-butoxycarbonylamino-5-oxo-pentanoic acid | CHEMBL170697
Type:
Small organic molecule
Emp. Form.:
C34H40F2N4O10
Mol. Mass.:
702.699
SMILES:
CC(C)(C)OC(=O)NC(CCC(O)=O)C(=O)N1CCC[C@H]1C(=O)NC(Cc1ccccc1)C(=O)C(F)(F)C(=O)Nc1cccc(CC(O)=O)c1
: