Target
Caspase-1
Ligand
BDBM50068945
Substrate
Meas. Tech.
ChEBML_90979
Ki
1.8±n/a nM
Citation
 Semple, GAshworth, DMBatt, ARBaxter, AJBenzies, DWElliot, LHEvans, DMFranklin, RJHudson, PJenkins, PDPitt, GRRooker, DPYamamoto, SIsomura, Y Peptidomimetic aminomethylene ketone inhibitors of interleukin-1 beta-converting enzyme (ICE). Bioorg Med Chem Lett 8:959-64 (1999)  
Target
Name:
Caspase-1
Synonyms:
CASP1 Caspase ICE IL1BCE Interleukin-1 beta-converting enzyme
Type:
Enzyme
Mol. Mass.:
45154.13
Organism:
Homo sapiens (Human)
Description:
P29466
Residue:
404
  
Inhibitor
Name:
BDBM50068945
Synonyms:
(S)-5-(Hexyl-methyl-amino)-3-(2-{3-[(naphthalene-2-carbonyl)-amino]-2-oxo-2H-pyridin-1-yl}-butyrylamino)-4-oxo-pentanoic acid | CHEMBL176584
Type:
Small organic molecule
Emp. Form.:
C32H40N4O6
Mol. Mass.:
576.6832
SMILES:
CCCCCCN(C)CC(=O)[C@H](CC(O)=O)NC(=O)C(CC)n1cccc(NC(=O)c2ccc3ccccc3c2)c1=O
: