Target
Caspase-1
Ligand
BDBM50068959
Substrate
Meas. Tech.
ChEBML_90979
Ki
255±n/a nM
Citation
 Semple, GAshworth, DMBatt, ARBaxter, AJBenzies, DWElliot, LHEvans, DMFranklin, RJHudson, PJenkins, PDPitt, GRRooker, DPYamamoto, SIsomura, Y Peptidomimetic aminomethylene ketone inhibitors of interleukin-1 beta-converting enzyme (ICE). Bioorg Med Chem Lett 8:959-64 (1999)  
Target
Name:
Caspase-1
Synonyms:
CASP1 Caspase ICE IL1BCE Interleukin-1 beta-converting enzyme
Type:
Enzyme
Mol. Mass.:
45154.13
Organism:
Homo sapiens (Human)
Description:
P29466
Residue:
404
  
Inhibitor
Name:
BDBM50068959
Synonyms:
(S)-5-[((S)-1-Carbamoyl-2-phenyl-ethyl)-methyl-amino]-3-(2-{3-[(naphthalene-2-carbonyl)-amino]-2-oxo-2H-pyridin-1-yl}-butyrylamino)-4-oxo-pentanoic acid | CHEMBL367294
Type:
Small organic molecule
Emp. Form.:
C35H37N5O7
Mol. Mass.:
639.6976
SMILES:
CCC(C(=O)N[C@@H](CC(O)=O)C(=O)CN(C)[C@@H](Cc1ccccc1)C(N)=O)n1cccc(NC(=O)c2ccc3ccccc3c2)c1=O
: