Target
Cysteinyl leukotriene receptor 1
Ligand
BDBM50009073
Substrate
Meas. Tech.
ChEBML_99998
IC50
44±n/a nM
Citation
 von Sprecher, AGerspacher, MBeck, AKimmel, SWiestner, HAnderson, GPNiederhauser, USubramanian, NBray, MA Synthesis and SAR of a novel, potent and structurally simple LTD4 antagonist of the quinoline class. Bioorg Med Chem Lett 8:965-70 (1999)  
Target
Name:
Cysteinyl leukotriene receptor 1
Synonyms:
CLTR1_CAVPO | CYSLTR1
Type:
Enzyme Catalytic Domain
Mol. Mass.:
39007.58
Organism:
GUINEA PIG
Description:
Leukotriene D4 0 GUINEA PIG::Q2NNR5
Residue:
340
  
Inhibitor
Name:
BDBM50009073
Synonyms:
4-(5-cyclopentyloxycarbonylamino-1-methyl-1H-indol-3-ylmethyl)-3-methoxy-N-o-tolylsulfonylbenzamide ZAFIRLUKAST cyclopentyl 3-[2-methoxy-4-(2-methylphenylsulfonylcarbamoyl)benzyl]-1-methyl-1H-indol-5-ylcarbamate
Type:
Small organic molecule
Emp. Form.:
C31H33N3O6S
Mol. Mass.:
575.675
SMILES:
COc1cc(ccc1Cc1cn(C)c2ccc(NC(=O)OC3CCCC3)cc12)C(=O)NS(=O)(=O)c1ccccc1C
: