Target
Progesterone receptor
Ligand
BDBM50069068
Substrate
Meas. Tech.
ChEBML_159369
IC50
750±n/a nM
Citation
 Edwards, JPWest, SJPooley, CLMarschke, KBFarmer, LJJones, TK New nonsteroidal androgen receptor modulators based on 4-(trifluoromethyl)-2(1H)-pyrrolidino[3,2-g] quinolinone. Bioorg Med Chem Lett 8:745-50 (1999)  
Target
Name:
Progesterone receptor
Synonyms:
NR3C3 PGR PRGR_HUMAN | progesterone
Type:
Protein
Mol. Mass.:
98979.52
Organism:
Homo sapiens (Human)
Description:
P06401
Residue:
933
  
Inhibitor
Name:
BDBM50069068
Synonyms:
(R)-2-Methyl-5-trifluoromethyl-1,2,3,8-tetrahydro-pyrrolo[3,2-g]quinolin-7-one | CHEMBL351465
Type:
Small organic molecule
Emp. Form.:
C13H11F3N2O
Mol. Mass.:
268.2344
SMILES:
C[C@@H]1Cc2cc3c(cc(=O)[nH]c3cc2N1)C(F)(F)F
: