Target
Interstitial collagenase
Ligand
BDBM50069218
Substrate
Meas. Tech.
ChEBML_101751
Ki
0.600000±n/a nM
Citation
 Jacobson, ICReddy, PGWasserman, ZRHardman, KDCovington, MBArner, ECCopeland, RADecicco, CPMagolda, RL Structure-based design and synthesis of a series of hydroxamic acids with a quaternary-hydroxy group in P1 as inhibitors of matrix metalloproteinases. Bioorg Med Chem Lett 8:837-42 (1999)  
Target
Name:
Interstitial collagenase
Synonyms:
CLG MMP1 Matrix metalloproteinase-1 | Matrix metalloproteinase-1 (MMP-1)
Type:
Enzyme
Mol. Mass.:
54010.26
Organism:
Homo sapiens (Human)
Description:
P03956
Residue:
469
  
Inhibitor
Name:
BDBM50069218
Synonyms:
(2R,3R)-2,N*1*-Dihydroxy-3-isobutyl-N*4*-[(S)-2-(4-methoxy-phenyl)-1-methylcarbamoyl-ethyl]-2-methyl-succinamide | CHEMBL353382
Type:
Small organic molecule
Emp. Form.:
C20H31N3O6
Mol. Mass.:
409.4766
SMILES:
CNC(=O)[C@H](Cc1ccc(OC)cc1)NC(=O)[C@H](CC(C)C)[C@@](C)(O)C(=O)NO
: