Target
Acetylcholinesterase
Ligand
BDBM50069248
Substrate
Meas. Tech.
ChEMBL_27796 (CHEMBL637623)
Ki
2100±n/a nM
Citation
 Perola, ECellai, LBrufani, M Synthesis and activity studies of N-[omega-N'-(adamant-1'-yl)aminoalkyl]- 2-(4'-dimethylaminophenyl)acetamides: in the search of selective inhibitors for the different molecular forms of acetylcholinesterase. Bioorg Med Chem Lett 8:575-80 (1999)  
Target
Name:
Acetylcholinesterase
Synonyms:
3.1.1.7 Acetylcholinesterase (AChE) ache
Type:
Mol. Mass.:
65900.74
Organism:
Tetronarce californica (Pacific electric ray) (Torpedo californica)
Description:
P04058
Residue:
586
  
Inhibitor
Name:
BDBM50069248
Synonyms:
CHEMBL421974 | N-[11-(Adamantan-1-ylamino)-undecyl]-2-(4-dimethylamino-phenyl)-acetamide
Type:
Small organic molecule
Emp. Form.:
C31H51N3O
Mol. Mass.:
481.7561
SMILES:
CN(C)c1ccc(CC(=O)NCCCCCCCCCCCNC23CC4CC(CC(C4)C2)C3)cc1
: