Target
Acetylcholinesterase
Ligand
BDBM50004000
Substrate
Meas. Tech.
ChEMBL_27807 (CHEMBL636517)
IC50
146±n/a nM
Citation
 Perola, ECellai, LBrufani, M Synthesis and activity studies of N-[omega-N'-(adamant-1'-yl)aminoalkyl]- 2-(4'-dimethylaminophenyl)acetamides: in the search of selective inhibitors for the different molecular forms of acetylcholinesterase. Bioorg Med Chem Lett 8:575-80 (1999)  
Target
Name:
Acetylcholinesterase
Synonyms:
ACES_BOVIN Acetylcholinesterase (AChE) | Acetylcholinesterase precursor
Type:
Enzyme
Mol. Mass.:
67659.62
Organism:
Bos taurus (bovine)
Description:
Residue:
613
  
Inhibitor
Name:
BDBM50004000
Synonyms:
(3aS,8aR)-1,3a,8-trimethyl-1,2,3,3a,8,8a-hexahydropyrrolo[2,3-b]indol-5-yl methylcarbamate CHEMBL94 Physostol | physostigmine
Type:
Small organic molecule
Emp. Form.:
C15H21N3O2
Mol. Mass.:
275.3461
SMILES:
CNC(=O)Oc1ccc2N(C)[C@H]3N(C)CC[C@@]3(C)c2c1
: