Target
Alpha-1A/Alpha-1B/Alpha-1D adrenergic receptor
Ligand
BDBM50069265
Substrate
Meas. Tech.
ChEMBL_32410 (CHEMBL648045)
Ki
5.7±n/a nM
Citation
 López-Rodríguez, MLMorcillo, MJRovat, TKFernández, ESanz, AMOrensanz, L 1-[omega-(4-arylpiperazin-1-yl)alkyl]-3-diphenylmethylene-2,5- pyrrolidinediones as 5-HT1A receptor ligands: study of the steric requirements of the terminal amide fragment on 5-HT1A affinity/selectivity. Bioorg Med Chem Lett 8:581-6 (1999)  
Target
Name:
Alpha-1A/Alpha-1B/Alpha-1D adrenergic receptor
Synonyms:
Adrenergic receptor alpha-1 alpha-1 Adrenergic Receptor
Type:
Mol. Mass.:
Description:
ASSAY_ID of EBI is 303470
Components:
This complex has 3 components.
Component 1
Name:
Alpha-1B adrenergic receptor
Synonyms:
ADA1B_RAT Alpha 1B-adrenoceptor Alpha adrenergic receptor 1A and 1B Alpha-1Adrenoceptor Alpha-1B adrenoreceptor | adrenergic Alpha1B
Type:
G Protein-Coupled Receptor (GPCR)
Mol. Mass.:
56606.71
Organism:
Rattus norvegicus (rat)
Description:
Receptor binding assays were performed using rat cortical membranes.
Residue:
515
  
Component 2
Name:
Alpha-1A adrenergic receptor
Synonyms:
ADA1A_RAT Adra1c Alpha-1A adrenoceptor Alpha-1C adrenergic receptor | adrenergic Alpha1A
Type:
Protein
Mol. Mass.:
51620.15
Organism:
Rattus norvegicus (Rat)
Description:
P43140
Residue:
466
  
Component 3
Name:
Alpha-1D adrenergic receptor
Synonyms:
ADA1D_RAT Adra1d Alpha-1D adrenergic receptor | Serotonin 1a (5-HT1a) receptor/Adrenergic receptor alpha-1
Type:
Protein
Mol. Mass.:
59375.97
Organism:
Rattus norvegicus (Rat)
Description:
P23944
Residue:
561
  
Inhibitor
Name:
BDBM50069265
Synonyms:
3-Benzhydrylidene-1-[3-(4-phenyl-piperazin-1-yl)-propyl]-pyrrolidine-2,5-dione | CHEMBL144876
Type:
Small organic molecule
Emp. Form.:
C30H31N3O2
Mol. Mass.:
465.586
SMILES:
O=[#6]-1-[#6]\[#6](=[#6](/c2ccccc2)-c2ccccc2)-[#6](=O)-[#7]-1-[#6]-[#6]-[#6]-[#7]-1-[#6]-[#6]-[#7](-[#6]-[#6]-1)-c1ccccc1
: