Target
D(2) dopamine receptor
Ligand
BDBM50069906
Substrate
Meas. Tech.
ChEBML_58458
Ki
456.0±n/a nM
Citation
 Mewshaw, REHusbands, MGildersleeve, ESWebb, MBShi, XMazandarani, HCockett, MIOchalski, RBrennan, JAAbou-Gharbia, MMarquis, KMcGaughey, GBCoupet, JAndree, TH New generation dopaminergic agents. 2. Discovery of 3-OH-phenoxyethylamine and 3-OH-N1-phenylpiperazine dopaminergic templates. Bioorg Med Chem Lett 8:295-300 (1999)  
Target
Name:
D(2) dopamine receptor
Synonyms:
D(2) dopamine receptor DOPAMINE D2 Long DRD2 Dopamine D2 receptor Dopamine D2 receptor (D2R) Dopamine2-like | d2
Type:
Cell-surface receptors
Mol. Mass.:
50647.10
Organism:
Homo sapiens (Human)
Description:
P14416
Residue:
443
  
Inhibitor
Name:
BDBM50069906
Synonyms:
2-(2-Benzylamino-ethoxy)-phenol | CHEMBL101285
Type:
Small organic molecule
Emp. Form.:
C15H17NO2
Mol. Mass.:
243.301
SMILES:
Oc1ccccc1OCCNCc1ccccc1
: