Target
D(2) dopamine receptor
Ligand
BDBM50069917
Substrate
Meas. Tech.
ChEBML_58458
Ki
>300±n/a nM
Citation
 Mewshaw, REHusbands, MGildersleeve, ESWebb, MBShi, XMazandarani, HCockett, MIOchalski, RBrennan, JAAbou-Gharbia, MMarquis, KMcGaughey, GBCoupet, JAndree, TH New generation dopaminergic agents. 2. Discovery of 3-OH-phenoxyethylamine and 3-OH-N1-phenylpiperazine dopaminergic templates. Bioorg Med Chem Lett 8:295-300 (1999)  
Target
Name:
D(2) dopamine receptor
Synonyms:
D(2) dopamine receptor DOPAMINE D2 Long DRD2 Dopamine D2 receptor Dopamine D2 receptor (D2R) Dopamine2-like | d2
Type:
Cell-surface receptors
Mol. Mass.:
50647.10
Organism:
Homo sapiens (Human)
Description:
P14416
Residue:
443
  
Inhibitor
Name:
BDBM50069917
Synonyms:
Benzyl-(2-phenoxy-ethyl)-amine | CHEMBL103951
Type:
Small organic molecule
Emp. Form.:
C15H17NO
Mol. Mass.:
227.3016
SMILES:
C(COc1ccccc1)NCc1ccccc1
: