Target
D(2) dopamine receptor
Ligand
BDBM50069917
Substrate
Meas. Tech.
ChEMBL_58480 (CHEMBL670411)
Ki
241±n/a nM
Citation
 Mewshaw, REHusbands, MGildersleeve, ESWebb, MBShi, XMazandarani, HCockett, MIOchalski, RBrennan, JAAbou-Gharbia, MMarquis, KMcGaughey, GBCoupet, JAndree, TH New generation dopaminergic agents. 2. Discovery of 3-OH-phenoxyethylamine and 3-OH-N1-phenylpiperazine dopaminergic templates. Bioorg Med Chem Lett 8:295-300 (1999)  
Target
Name:
D(2) dopamine receptor
Synonyms:
DOPAMINE D2 DOPAMINE D2 Short Dopamine D2 receptor Drd2
Type:
G Protein-Coupled Receptor (GPCR)
Mol. Mass.:
50931.60
Organism:
Rattus norvegicus (rat)
Description:
P61169
Residue:
444
  
Inhibitor
Name:
BDBM50069917
Synonyms:
Benzyl-(2-phenoxy-ethyl)-amine | CHEMBL103951
Type:
Small organic molecule
Emp. Form.:
C15H17NO
Mol. Mass.:
227.3016
SMILES:
C(COc1ccccc1)NCc1ccccc1
: