Target
Prothrombin
Ligand
BDBM50069938
Substrate
Meas. Tech.
ChEBML_208314
Ki
0.580000±n/a nM
Citation
 Fevig, JMBuriak, JCacciola, JAlexander, RSKettner, CAKnabb, RMPruitt, JRWeber, PCWexler, RR Rational design of boropeptide thrombin inhibitors: beta, beta-dialkyl-phenethylglycine P2 analogs of DuP 714 with greater selectivity over complement factor I and an improved safety profile. Bioorg Med Chem Lett 8:301-6 (1999)  
Target
Name:
Prothrombin
Synonyms:
Activation peptide fragment 1 Coagulation factor II Prothrombin precursor Thrombin heavy chain | Thrombin light chain
Type:
Protein
Mol. Mass.:
70029.57
Organism:
Homo sapiens (Human)
Description:
P00734
Residue:
622
  
Inhibitor
Name:
BDBM50069938
Synonyms:
Boropeptide analogue | CHEMBL103077
Type:
Small organic molecule
Emp. Form.:
C26H38BN5O4
Mol. Mass.:
495.422
SMILES:
Cc1cc(C)cc(CCN(CC(=O)NC(CCCNC(N)=N)B(O)O)C(=O)CCc2ccccc2)c1
: