Target
D(1A) dopamine receptor
Ligand
BDBM50070184
Substrate
Meas. Tech.
ChEBML_58297
IC50
1420±n/a nM
Citation
 Mantegani, SBrambilla, ECaccia, CDamiani, GFornaretto, MGMcArthur, RAVarasi, M Serotonergic ergoline derivatives. Bioorg Med Chem Lett 8:1117-22 (1999)  
Target
Name:
D(1A) dopamine receptor
Synonyms:
DOPAMINE D1 Dopamine D1 high Dopamine receptor Dopamine1-like Drd1a
Type:
Enzyme Catalytic Domain
Mol. Mass.:
49429.75
Organism:
RAT
Description:
P18901
Residue:
446
  
Inhibitor
Name:
BDBM50070184
Synonyms:
((6aR,9S,10aR)-7-Methyl-4,6,6a,7,8,9,10,10a-octahydro-indolo[4,3-fg]quinolin-9-ylmethyl)-carbamic acid benzyl ester CHEMBL13816
Type:
Small organic molecule
Emp. Form.:
C24H27N3O2
Mol. Mass.:
389.4901
SMILES:
CN1C[C@H](CNC(=O)OCc2ccccc2)C[C@H]2[C@H]1Cc1c[nH]c3cccc2c13
: