Target
Interstitial collagenase
Ligand
BDBM50070225
Substrate
Meas. Tech.
ChEBML_105964
IC50
380±n/a nM
Citation
 Campbell, DAXiao, XYHarris, DIda, SMortezaei, RNgu, KShi, LTien, DWang, YNavre, MPatel, DVSharr, MADiJoseph, JFKillar, LMLeone, CLLevin, JISkotnicki, JS Malonyl alpha-mercaptoketones and alpha-mercaptoalcohols, a new class of matrix metalloproteinase inhibitors. Bioorg Med Chem Lett 8:1157-62 (1999)  
Target
Name:
Interstitial collagenase
Synonyms:
CLG MMP1 Matrix metalloproteinase-1 | Matrix metalloproteinase-1 (MMP-1)
Type:
Enzyme
Mol. Mass.:
54010.26
Organism:
Homo sapiens (Human)
Description:
P03956
Residue:
469
  
Inhibitor
Name:
BDBM50070225
Synonyms:
2-(1-Hydroxy-2-mercapto-ethyl)-4-methyl-pentanoic acid ((S)-2,2-dimethyl-1-methylcarbamoyl-propyl)-amide | CHEMBL274700
Type:
Small organic molecule
Emp. Form.:
C15H30N2O3S
Mol. Mass.:
318.475
SMILES:
CNC(=O)[C@@H](NC(=O)C(CC(C)C)C(O)CS)C(C)(C)C
: