Target
Gastrin/cholecystokinin type B receptor
Ligand
BDBM50070412
Substrate
Meas. Tech.
ChEBML_40213
Ki
15±n/a nM
Citation
 Bellier, BDa Nascimento, SMeudal, HGincel, ERoques, BPGarbay, C Novel constrained CCK-B dipeptoid antagonists derived from pipecolic acid. Bioorg Med Chem Lett 8:1419-24 (1999)  
Target
Name:
Gastrin/cholecystokinin type B receptor
Synonyms:
Cckbr Cholecystokinin B receptor GASR_RAT | Gastrin/cholecystokinin type B receptor
Type:
Enzyme Catalytic Domain
Mol. Mass.:
48980.43
Organism:
RAT
Description:
Cholecystokinin A CCKBR RAT::P30553
Residue:
452
  
Inhibitor
Name:
BDBM50070412
Synonyms:
(2R,4R)-1-[(R)-2-(Adamantan-2-yloxycarbonylamino)-3-(1H-indol-3-yl)-2-methyl-propionyl]-4-(2,4-dichloro-phenoxy)-pyrrolidine-2-carboxylic acid | CHEMBL289021
Type:
Small organic molecule
Emp. Form.:
C34H37Cl2N3O6
Mol. Mass.:
654.58
SMILES:
C[C@](Cc1c[nH]c2ccccc12)(NC(=O)OC1C2CC3CC(C2)CC1C3)C(=O)N1C[C@@H](C[C@@H]1C(O)=O)Oc1ccc(Cl)cc1Cl
: