Target
Interstitial collagenase
Ligand
BDBM50070454
Substrate
Meas. Tech.
ChEBML_105954
IC50
37±n/a nM
Citation
 Curtin, MLGarland, RBDavidsen, SKMarcotte, PAAlbert, DHMagoc, TJHutchins, C Broad spectrum matrix metalloproteinase inhibitors: an examination of succinamide hydroxamate inhibitors with P1 C alpha gem-disubstitution. Bioorg Med Chem Lett 8:1443-8 (1999)  
Target
Name:
Interstitial collagenase
Synonyms:
CLG MMP1 Matrix metalloproteinase-1 | Matrix metalloproteinase-1 (MMP-1)
Type:
Enzyme
Mol. Mass.:
54010.26
Organism:
Homo sapiens (Human)
Description:
P03956
Residue:
469
  
Inhibitor
Name:
BDBM50070454
Synonyms:
1-[(R)-3-Methyl-1-((S)-1-methylcarbamoyl-2-phenyl-ethylcarbamoyl)-butyl]-cyclopentanecarboxylic acid hydroxyamide | CHEMBL286295
Type:
Small organic molecule
Emp. Form.:
C22H33N3O4
Mol. Mass.:
403.5151
SMILES:
CNC(=O)[C@H](Cc1ccccc1)NC(=O)[C@H](CC(C)C)C1(CCCC1)C(=O)NO
: