Target
72 kDa type IV collagenase
Ligand
BDBM50070461
Substrate
Meas. Tech.
ChEBML_104363
IC50
6.2±n/a nM
Citation
 Curtin, MLGarland, RBDavidsen, SKMarcotte, PAAlbert, DHMagoc, TJHutchins, C Broad spectrum matrix metalloproteinase inhibitors: an examination of succinamide hydroxamate inhibitors with P1 C alpha gem-disubstitution. Bioorg Med Chem Lett 8:1443-8 (1999)  
Target
Name:
72 kDa type IV collagenase
Synonyms:
72 kDa gelatinase CLG4A Gelatinase A (MMP-2) MMP2_HUMAN Matrix metalloproteinase-2 (MMP 2) Matrix metalloproteinases 2 (MMP-2) | TBE-1
Type:
Enzyme
Mol. Mass.:
73870.36
Organism:
Homo sapiens (Human)
Description:
P08253
Residue:
660
  
Inhibitor
Name:
BDBM50070461
Synonyms:
(2S,3R)-2-Allyl-N*4*-((S)-2,2-dimethyl-1-phenylcarbamoyl-propyl)-N*1*-hydroxy-3-isobutyl-2-methyl-succinamide | CHEMBL32285
Type:
Small organic molecule
Emp. Form.:
C24H37N3O4
Mol. Mass.:
431.5683
SMILES:
CC(C)C[C@@H](C(=O)N[C@H](C(=O)Nc1ccccc1)C(C)(C)C)[C@](C)(CC=C)C(=O)NO
: