Target
Carbonic anhydrase 7
Ligand
BDBM50515558
Substrate
Meas. Tech.
ChEMBL_1861558 (CHEMBL4362414)
Ki
0.780000±n/a nM
Citation
 Tanini, DRicci, LCapperucci, ADi Cesare Mannelli, LGhelardini, CPeat, TSCarta, FAngeli, ASupuran, CT Synthesis of novel tellurides bearing benzensulfonamide moiety as carbonic anhydrase inhibitors with antitumor activity. Eur J Med Chem 181:0 (2019)  
Target
Name:
Carbonic anhydrase 7
Synonyms:
CA-VII CAH7_HUMAN Carbonic anhydrase Carbonic anhydrase VII (CA VII)
Type:
Enzyme
Mol. Mass.:
29664.11
Organism:
Homo sapiens (Human)
Description:
Human cloned isozyme.
Residue:
264
  
Inhibitor
Name:
BDBM50515558
Synonyms:
CHEMBL4535036
Type:
Small organic molecule
Emp. Form.:
C15H17NO4STe
Mol. Mass.:
435
SMILES:
[#7]S(=O)(=O)c1ccc(-[#8]-[#6]-[#6](-[#8])-[#6][Te;v2]c2ccccc2)cc1
: