Target
Carbonic anhydrase 2
Ligand
BDBM50515564
Substrate
Meas. Tech.
ChEMBL_1861556 (CHEMBL4362412)
Ki
0.620000±n/a nM
Citation
 Tanini, DRicci, LCapperucci, ADi Cesare Mannelli, LGhelardini, CPeat, TSCarta, FAngeli, ASupuran, CT Synthesis of novel tellurides bearing benzensulfonamide moiety as carbonic anhydrase inhibitors with antitumor activity. Eur J Med Chem 181:0 (2019)  
Target
Name:
Carbonic anhydrase 2
Synonyms:
CA-II CAC Carbonate dehydratase II Carbonic anhydrase 2 (CA-II) Carbonic anhydrase C Carbonic anhydrase II (CA-II) Carbonic anhydrase II (hCA II) | Carbonic anhydrase isoenzyme II (hCA II)
Type:
Enzyme
Mol. Mass.:
29250.71
Organism:
Homo sapiens (Human)
Description:
P00918
Residue:
260
  
Inhibitor
Name:
BDBM50515564
Synonyms:
CHEMBL4535469
Type:
Small organic molecule
Emp. Form.:
C18H24N2O8S2Te
Mol. Mass.:
588.1
SMILES:
[#7]S(=O)(=O)c1ccc(-[#8]-[#6]-[#6](-[#8])-[#6][Te;v2][#6]-[#6](-[#8])-[#6]-[#8]-c2ccc(cc2)S([#7])(=O)=O)cc1
: