Target
Protein kinase C alpha type
Ligand
BDBM50070859
Substrate
Meas. Tech.
ChEBML_152819
Ki
320±n/a nM
Citation
 Marquez, VESharma, RWang, SLewin, NEBlumberg, PMKim, ISLee, J Conformationally constrained analogues of diacylglycerol (DAG). 14. Dissection of the roles of the sn-1 and sn-2 carbonyls in DAG mimetics by isopharmacophore replacement. Bioorg Med Chem Lett 8:1757-62 (1999)  
Target
Name:
Protein kinase C alpha type
Synonyms:
KPCA_HUMAN PKC alpha and beta-2 PKC-alpha PRKACA Protein Kinase C- alpha Protein kinase C alpha (PKCa) Protein kinase C alpha type (PRKCA) RAF proto-oncogene serine/threonine-protein kinase
Type:
Enzyme
Mol. Mass.:
76755.65
Organism:
Homo sapiens (Human)
Description:
The recombinant human PKC enzymes were produced using a baculovirus expression system in SF9 cells
Residue:
672
  
Inhibitor
Name:
BDBM50070859
Synonyms:
Acetic acid 5-hydroxymethyl-2,2-dioxo-3-tetradec-(E)-ylidene-2lambda*6*-[1,2]oxathiolan-5-ylmethyl ester | CHEMBL52329
Type:
Small organic molecule
Emp. Form.:
C21H38O6S
Mol. Mass.:
418.588
SMILES:
CCCCCCCCCCCCC\C=C1/CC(CO)(COC(C)=O)OS1(=O)=O
: