Target
Potassium-transporting ATPase alpha chain 1/subunit beta
Ligand
BDBM50071079
Substrate
Meas. Tech.
ChEMBL_76263 (CHEMBL690673)
pH
7.4±n/a
IC50
33000±n/a nM
Comments
extracted
Citation
 Yoon, SHSeo, SLee, YHwang, SKim, DY Syntheses of 2-[(3,5-dimethyl-4-methoxypyridyl)alkyl]-benzothiazolidine derivatives as a potential gastric H+/K(+)-ATPase inhibitor. Bioorg Med Chem Lett 8:1909-12 (1999)  
Target
Name:
Potassium-transporting ATPase alpha chain 1/subunit beta
Synonyms:
Potassium-transporting ATPase | Potassium-transporting ATPase alpha chain 1/beta chain
Type:
Mol. Mass.:
Description:
ASSAY_ID of EBI is 71495
Components:
This complex has 2 components.
Component 1
Name:
Potassium-transporting ATPase alpha chain 1
Synonyms:
ATP4A Gastric H(+)/K(+) ATPase subunit alpha Potassium-transporting ATPase alpha chain 1 | Proton pump
Type:
PROTEIN
Mol. Mass.:
114109.05
Organism:
Homo sapiens (Human)
Description:
EBI_82
Residue:
1035
  
Component 2
Name:
Potassium-transporting ATPase subunit beta
Synonyms:
ATP4B Gastric H(+)/K(+) ATPase subunit beta Potassium-transporting ATPase subunit beta | Proton pump beta chain
Type:
PROTEIN
Mol. Mass.:
33369.83
Organism:
Homo sapiens (Human)
Description:
EBI_10719
Residue:
291
  
Inhibitor
Name:
BDBM50071079
Synonyms:
5-Fluoro-2-[2-(4-methoxy-3,5-dimethyl-pyridin-2-yl)-ethyl]-2-methyl-2,3-dihydro-benzothiazole | CHEMBL58681
Type:
Small organic molecule
Emp. Form.:
C18H21FN2OS
Mol. Mass.:
332.436
SMILES:
COc1c(C)cnc(CCC2(C)Nc3cc(F)ccc3S2)c1C
: