Target
Oxytocin receptor
Ligand
BDBM50516424
Substrate
Meas. Tech.
ChEMBL_1865144 (CHEMBL4366119)
IC50
235±n/a nM
Citation
 Li, XZhang, ZChen, YWan, HSun, JWang, BFeng, BHu, BShi, XFeng, JZhang, LHe, FBai, CZhang, LTao, W Discovery of SHR1653, a Highly Potent and Selective OTR Antagonist with Improved Blood-Brain Barrier Penetration. ACS Med Chem Lett 10:996-1001 (2019)  
Target
Name:
Oxytocin receptor
Synonyms:
OT-R OXYR_HUMAN | Oxytocin
Type:
Enzyme Catalytic Domain
Mol. Mass.:
42793.26
Organism:
Homo sapiens (Human)
Description:
Oxytocin OXTR HEK293::B2R9L7
Residue:
389
  
Inhibitor
Name:
BDBM50516424
Synonyms:
CHEMBL4575160
Type:
Small organic molecule
Emp. Form.:
C21H18ClFN6O
Mol. Mass.:
424.859
SMILES:
[H][C@@]12C[C@@]1(CN(C2)c1nnc(CC#N)n1-c1ccc(OC)nc1)c1ccc(F)cc1Cl
: