Target
Interstitial collagenase
Ligand
BDBM50071260
Substrate
Meas. Tech.
ChEBML_101734
IC50
110±n/a nM
Citation
 Steinman, DHCurtin, MLGarland, RBDavidsen, SKHeyman, HRHolms, JHAlbert, DHMagoc, TJNagy, IBMarcotte, PALi, JMorgan, DWHutchins, CSummers, JB The design, synthesis, and structure-activity relationships of a series of macrocyclic MMP inhibitors. Bioorg Med Chem Lett 8:2087-92 (1999)  
Target
Name:
Interstitial collagenase
Synonyms:
CLG MMP1 Matrix metalloproteinase-1 | Matrix metalloproteinase-1 (MMP-1)
Type:
Enzyme
Mol. Mass.:
54010.26
Organism:
Homo sapiens (Human)
Description:
P03956
Residue:
469
  
Inhibitor
Name:
BDBM50071260
Synonyms:
(7R,8R,11S)-8-Isobutyl-9-oxo-2-oxa-10-aza-bicyclo[11.2.2]heptadeca-1(16),13(17),14-triene-7,11-dicarboxylic acid 7-hydroxyamide 11-methylamide | CHEMBL302227
Type:
Small organic molecule
Emp. Form.:
C22H33N3O5
Mol. Mass.:
419.5145
SMILES:
CNC(=O)[C@@H]1Cc2ccc(OCCCC[C@H]([C@@H](CC(C)C)C(=O)N1)C(=O)NO)cc2
: