Target
72 kDa type IV collagenase
Ligand
BDBM50071263
Substrate
Meas. Tech.
ChEBML_101906
IC50
2.2±n/a nM
Citation
 Steinman, DHCurtin, MLGarland, RBDavidsen, SKHeyman, HRHolms, JHAlbert, DHMagoc, TJNagy, IBMarcotte, PALi, JMorgan, DWHutchins, CSummers, JB The design, synthesis, and structure-activity relationships of a series of macrocyclic MMP inhibitors. Bioorg Med Chem Lett 8:2087-92 (1999)  
Target
Name:
72 kDa type IV collagenase
Synonyms:
72 kDa gelatinase CLG4A Gelatinase A (MMP-2) MMP2_HUMAN Matrix metalloproteinase-2 (MMP 2) Matrix metalloproteinases 2 (MMP-2) | TBE-1
Type:
Enzyme
Mol. Mass.:
73870.36
Organism:
Homo sapiens (Human)
Description:
P08253
Residue:
660
  
Inhibitor
Name:
BDBM50071263
Synonyms:
(7S,8R,11S)-8-Isobutyl-9-oxo-2-oxa-10-aza-bicyclo[11.2.2]heptadeca-1(16),13(17),14-triene-7,11-dicarboxylic acid 7-hydroxyamide 11-methylamide | CHEMBL418292
Type:
Small organic molecule
Emp. Form.:
C22H33N3O5
Mol. Mass.:
419.5145
SMILES:
CNC(=O)[C@@H]1Cc2ccc(OCCCC[C@@H]([C@@H](CC(C)C)C(=O)N1)C(=O)NO)cc2
: