Target
Stromelysin-1
Ligand
BDBM50071267
Substrate
Meas. Tech.
ChEBML_101938
IC50
1.5±n/a nM
Citation
 Steinman, DHCurtin, MLGarland, RBDavidsen, SKHeyman, HRHolms, JHAlbert, DHMagoc, TJNagy, IBMarcotte, PALi, JMorgan, DWHutchins, CSummers, JB The design, synthesis, and structure-activity relationships of a series of macrocyclic MMP inhibitors. Bioorg Med Chem Lett 8:2087-92 (1999)  
Target
Name:
Stromelysin-1
Synonyms:
MMP-3 MMP3_HUMAN Matrix metalloproteinase 3 Matrix metalloproteinase-3 (MMP-3) SL-1 Stromelysin 1 | Transin-1
Type:
Enzyme
Mol. Mass.:
53973.13
Organism:
Homo sapiens (Human)
Description:
P08254
Residue:
477
  
Inhibitor
Name:
BDBM50071267
Synonyms:
(7S,8R,11S)-9-Oxo-8-[2-(4-propyl-phenyl)-ethyl]-2-oxa-10-aza-bicyclo[11.2.2]heptadeca-1(16),13(17),14-triene-7,11-dicarboxylic acid 7-hydroxyamide 11-methylamide | CHEMBL418291
Type:
Small organic molecule
Emp. Form.:
C29H39N3O5
Mol. Mass.:
509.6371
SMILES:
CCCc1ccc(CC[C@@H]2[C@H](CCCCOc3ccc(C[C@H](NC2=O)C(=O)NC)cc3)C(=O)NO)cc1
: