Target
Stromelysin-1
Ligand
BDBM50071268
Substrate
Meas. Tech.
ChEBML_101938
IC50
2.6±n/a nM
Citation
 Steinman, DHCurtin, MLGarland, RBDavidsen, SKHeyman, HRHolms, JHAlbert, DHMagoc, TJNagy, IBMarcotte, PALi, JMorgan, DWHutchins, CSummers, JB The design, synthesis, and structure-activity relationships of a series of macrocyclic MMP inhibitors. Bioorg Med Chem Lett 8:2087-92 (1999)  
Target
Name:
Stromelysin-1
Synonyms:
MMP-3 MMP3_HUMAN Matrix metalloproteinase 3 Matrix metalloproteinase-3 (MMP-3) SL-1 Stromelysin 1 | Transin-1
Type:
Enzyme
Mol. Mass.:
53973.13
Organism:
Homo sapiens (Human)
Description:
P08254
Residue:
477
  
Inhibitor
Name:
BDBM50071268
Synonyms:
(7S,8R,11S)-8-Isobutyl-9-oxo-2-oxa-10-aza-bicyclo[11.2.2]heptadeca-1(16),13(17),14-triene-7,11-dicarboxylic acid 7-hydroxyamide 11-pyridin-2-ylamide | CHEMBL65159
Type:
Small organic molecule
Emp. Form.:
C26H34N4O5
Mol. Mass.:
482.572
SMILES:
CC(C)C[C@@H]1[C@H](CCCCOc2ccc(C[C@H](NC1=O)C(=O)Nc1ccccn1)cc2)C(=O)NO
: