Target
Stromelysin-1
Ligand
BDBM50064341
Substrate
Meas. Tech.
ChEBML_101938
IC50
7.8±n/a nM
Citation
 Steinman, DHCurtin, MLGarland, RBDavidsen, SKHeyman, HRHolms, JHAlbert, DHMagoc, TJNagy, IBMarcotte, PALi, JMorgan, DWHutchins, CSummers, JB The design, synthesis, and structure-activity relationships of a series of macrocyclic MMP inhibitors. Bioorg Med Chem Lett 8:2087-92 (1999)  
Target
Name:
Stromelysin-1
Synonyms:
MMP-3 MMP3_HUMAN Matrix metalloproteinase 3 Matrix metalloproteinase-3 (MMP-3) SL-1 Stromelysin 1 | Transin-1
Type:
Enzyme
Mol. Mass.:
53973.13
Organism:
Homo sapiens (Human)
Description:
P08254
Residue:
477
  
Inhibitor
Name:
BDBM50064341
Synonyms:
(6S,7R,10S)-7-Isobutyl-8-oxo-2-oxa-9-aza-bicyclo[10.2.2]hexadeca-1(15),12(16),13-triene-6,10-dicarboxylic acid 6-hydroxyamide 10-methylamide CHEMBL45631
Type:
Small organic molecule
Emp. Form.:
C21H31N3O5
Mol. Mass.:
405.4879
SMILES:
CNC(=O)[C@@H]1Cc2ccc(OCCC[C@@H]([C@@H](CC(C)C)C(=O)N1)C(=O)NO)cc2
: