Target
Histamine H3 receptor
Ligand
BDBM50071347
Substrate
Meas. Tech.
ChEMBL_85850 (CHEMBL693577)
Ki
21±n/a nM
Citation
 Wolin, RConnolly, MAfonso, AHey, JAShe, HRivelli, MAWillams, SMWest, RE Novel H3 receptor antagonists. Sulfonamide homologs of histamine. Bioorg Med Chem Lett 8:2157-62 (1999)  
Target
Name:
Histamine H3 receptor
Synonyms:
HISTAMINE H3 HRH3_CAVPO | Histamine H3 receptor
Type:
Enzyme Catalytic Domain
Mol. Mass.:
48753.61
Organism:
GUINEA PIG
Description:
HISTAMINE H3 HRH3 GUINEA PIG::Q9JI35
Residue:
445
  
Inhibitor
Name:
BDBM50071347
Synonyms:
4-Fluoro-N-[4-(1H-imidazol-4-yl)-butyl]-benzenesulfonamide | CHEMBL71487
Type:
Small organic molecule
Emp. Form.:
C13H16FN3O2S
Mol. Mass.:
297.348
SMILES:
Fc1ccc(cc1)S(=O)(=O)NCCCCc1cnc[nH]1
: