Target
Dihydroorotate dehydrogenase (quinone), mitochondrial
Ligand
BDBM50071396
Substrate
Meas. Tech.
ChEBML_52886
IC50
7200±n/a nM
Citation
 Albert, RKnecht, HAndersen, EHungerford, VSchreier, MHPapageorgiou, C Isoxazolylthioamides as potential immunosuppressants a combinatorial chemistry approach. Bioorg Med Chem Lett 8:2203-8 (1999)  
Target
Name:
Dihydroorotate dehydrogenase (quinone), mitochondrial
Synonyms:
DHODH Dihydroorotate dehydrogenase Dihydroorotate dehydrogenase, mitochondrial Dihydroorotate oxidase (DHODH) | PYRD_HUMAN
Type:
Enzyme
Mol. Mass.:
42881.33
Organism:
Homo sapiens (Human)
Description:
Q02127
Residue:
395
  
Inhibitor
Name:
BDBM50071396
Synonyms:
5-Methyl-isoxazole-4-carbothioic acid (4-trifluoromethoxy-phenyl)-amide | CHEMBL70261
Type:
Small organic molecule
Emp. Form.:
C12H9F3N2O2S
Mol. Mass.:
302.272
SMILES:
Cc1oncc1C(=S)Nc1ccc(OC(F)(F)F)cc1
: