Target
Endothelin receptor type B
Ligand
BDBM50071421
Substrate
Meas. Tech.
ChEBML_64012
Ki
0.340000±n/a nM
Citation
 Sakaki, JMurata, TYuumoto, YNakamura, ITrueh, TPitterna, TIwasaki, GOda, KYamamura, THayakawa, K Discovery of IRL 3461: a novel and potent endothelin antagonist with balanced ETA/ETB affinity. Bioorg Med Chem Lett 8:2241-6 (1999)  
Target
Name:
Endothelin receptor type B
Synonyms:
EDNRB ENDOTHELIN B ETRB Endothelin receptor non-selective type | Endothelin receptor, ET-A/ET-B
Type:
Enzyme Catalytic Domain
Mol. Mass.:
49664.00
Organism:
Homo sapiens (Human)
Description:
ENDOTHELIN B EDNRB HUMAN::P24530
Residue:
442
  
Inhibitor
Name:
BDBM50071421
Synonyms:
CHEMBL310920 | N-[(R)-1-[(S)-2-Benzenesulfonylamino-1-(1H-indol-3-ylmethyl)-2-oxo-ethylcarbamoyl]-2-(4-isoxazol-5-yl-phenyl)-ethyl]-3,5,N-trimethyl-benzamide
Type:
Small organic molecule
Emp. Form.:
C39H37N5O6S
Mol. Mass.:
703.806
SMILES:
CN([C@H](Cc1ccc(cc1)-c1ccno1)C(=O)N[C@@H](Cc1c[nH]c2ccccc12)C(=O)NS(=O)(=O)c1ccccc1)C(=O)c1cc(C)cc(C)c1
: