Target
Endothelin-1 receptor
Ligand
BDBM50071426
Substrate
Meas. Tech.
ChEBML_65820
Ki
5.5±n/a nM
Citation
 Sakaki, JMurata, TYuumoto, YNakamura, ITrueh, TPitterna, TIwasaki, GOda, KYamamura, THayakawa, K Discovery of IRL 3461: a novel and potent endothelin antagonist with balanced ETA/ETB affinity. Bioorg Med Chem Lett 8:2241-6 (1999)  
Target
Name:
Endothelin-1 receptor
Synonyms:
EDNRA ET-A ETA-R Endothelin receptor type A hET-AR
Type:
Enzyme Catalytic Domain
Mol. Mass.:
48736.88
Organism:
Homo sapiens (Human)
Description:
P25101
Residue:
427
  
Inhibitor
Name:
BDBM50071426
Synonyms:
CHEMBL73835 | N-[(R)-1-[1-(Butane-1-sulfonylaminocarbonyl)-propylcarbamoyl]-2-(4-isoxazol-5-yl-phenyl)-ethyl]-3,5,N-trimethyl-benzamide
Type:
Small organic molecule
Emp. Form.:
C30H38N4O6S
Mol. Mass.:
582.711
SMILES:
CCCCS(=O)(=O)NC(=O)C(CC)NC(=O)[C@@H](Cc1ccc(cc1)-c1ccno1)N(C)C(=O)c1cc(C)cc(C)c1
: