Target
Kallikrein-1
Ligand
BDBM50071563
Substrate
Meas. Tech.
ChEBML_92390
Ki
31±n/a nM
Citation
 Ogbu, COQabar, MNBoatman, PDUrban, JMeara, JPFerguson, MDTulinsky, JLum, CBabu, SBlaskovich, MANakanishi, HRuan, FCao, BMinarik, RLittle, TNelson, SNguyen, MGall, AKahn, M Highly efficient and versatile synthesis of libraries of constrained beta-strand mimetics. Bioorg Med Chem Lett 8:2321-6 (1999)  
Target
Name:
Kallikrein-1
Synonyms:
KLK1 Kallikrein 1 Kidney/pancreas/salivary gland kallikrein | Tissue kallikrein
Type:
Enzyme
Mol. Mass.:
28874.69
Organism:
Homo sapiens (Human)
Description:
P06870
Residue:
262
  
Inhibitor
Name:
BDBM50071563
Synonyms:
4-(2-{6-amino-2-[7-(3,4-dichlorobenzyl)-13,13-dimethyl-6,8-dioxo-5,7,9-triazatetracyclo[10.1.1.02,10.05,9]tetradec-2-en-4-ylcarboxamido]hexanoylcarboxamido}ethyl)benzamide | CHEMBL74851
Type:
Small organic molecule
Emp. Form.:
C37H43Cl2N7O6
Mol. Mass.:
752.687
SMILES:
CC1(C)C2CC1C1=CC(C(=O)NC(CCCCN)C(=O)C(=O)NCCc3ccc(cc3)C(N)=O)n3n(C1C2)c(=O)n(Cc1ccc(Cl)c(Cl)c1)c3=O
: