Target
Tyrosine-protein kinase Lck
Ligand
BDBM50071675
Substrate
Meas. Tech.
ChEBML_221490
IC50
1400±n/a nM
Citation
 Bullington, JLCameron, JCDavis, JEDodd, JHHarris, CAHenry, JRPellegrino-Gensey, JLRupert, KCSiekierka, JJ The development of novel and selective p56lck tyrosine kinase inhibitors. Bioorg Med Chem Lett 8:2489-94 (1999)  
Target
Name:
Tyrosine-protein kinase Lck
Synonyms:
2.7.10.2 LCK_HUMAN Leukocyte C-terminal Src kinase Lymphocyte-specific protein tyrosine kinase Protein YT16 Proto-oncogene tyrosine-protein kinase LCK T cell-specific protein-tyrosine kinase
Type:
Mol. Mass.:
57987.83
Organism:
Homo sapiens (Human)
Description:
P06239
Residue:
509
  
Inhibitor
Name:
BDBM50071675
Synonyms:
2-[1-(3,5-Dichloro-4-hydroxy-phenyl)-meth-(Z)-ylidene]-4-nitro-indan-1,3-dione | CHEMBL83376
Type:
Small organic molecule
Emp. Form.:
C16H7Cl2NO5
Mol. Mass.:
364.136
SMILES:
Oc1c(Cl)cc(\C=C2\C(=O)c3cccc(c3C2=O)[N+]([O-])=O)cc1Cl
: