Target
Protein farnesyltransferase subunit beta/geranylgeranyltransferase type-1 subunit alpha
Ligand
BDBM50071698
Substrate
Meas. Tech.
ChEBML_68477
IC50
520±n/a nM
Citation
 Wolin, RConnolly, MKelly, JWeinstein, JRosenblum, SAfonso, AJames, LKirschmeier, PBishop, WR Inhibitors of farnesyl protein transferase. Synthesis and biological activity of amide and cyanoguanidine derivatives containing a 5,11-dihydro[1]benzthiepin, benzoxepin, and benzazepin [4,3-b]pyridine ring system. Bioorg Med Chem Lett 8:2521-6 (1999)  
Target
Name:
Protein farnesyltransferase subunit beta/geranylgeranyltransferase type-1 subunit alpha
Synonyms:
Farnesyltransferase (FTase) Protein Farnesyltransferase (PFT) Chain B | Protein farnesyltransferase
Type:
Protein Complex
Mol. Mass.:
Description:
To express recombinant enzyme in E. coli, the cloned human alpha and beta subunits were co-expressed from a plasmid, in which their expression was translationally coupled.
Components:
This complex has 2 components.
Component 1
Name:
Protein farnesyltransferase subunit beta
Synonyms:
CAAX farnesyltransferase subunit alpha FNTB FTase-alpha GGTase-I-alpha Protein farnesyl/geranylgeranyl transferase Protein farnesyltransferase subunit beta Protein farnesyltransferase/geranylgeranyltransferase type-1 subunit alpha Ras proteins prenyltransferase subunit beta | Type I protein geranyl-geranyltransferase subunit alpha
Type:
Enzyme Subunit
Mol. Mass.:
48766.02
Organism:
Homo sapiens (Human)
Description:
Protein farnesyltransferase subunit beta
Residue:
437
  
Component 2
Name:
Protein farnesyltransferase/geranylgeranyltransferase type-1 subunit alpha
Synonyms:
CAAX farnesyltransferase alpha subunit FNTA_HUMAN FTase-alpha Geranylgeranyl Transferase (GGTase-I) Chain A Protein Farnesyltransferase (PFT) Chain A Protein farnesyltransferase Protein farnesyltransferase/geranylgeranyltransferase type I alpha subunit | Ras proteins prenyltransferase alpha
Type:
Enzyme
Mol. Mass.:
44392.46
Organism:
Homo sapiens (Human)
Description:
Recombinant human FTase.
Residue:
379
  
Inhibitor
Name:
BDBM50071698
Synonyms:
1-[4-(8-Chloro-11H-10-thia-4-aza-dibenzo[a,d]cyclohepten-5-ylidene)-piperidin-1-yl]-2-(1-oxy-pyridin-4-yl)-ethanone | CHEMBL309483
Type:
Small organic molecule
Emp. Form.:
C25H22ClN3O2S
Mol. Mass.:
463.979
SMILES:
[#8-]-[n+]1ccc(-[#6]-[#6](=O)-[#7]-2-[#6]-[#6]\[#6](-[#6]-[#6]-2)=[#6]-2\c3ccc(Cl)cc3-[#16]-[#6]-c3cccnc-23)cc1
: