Target
Chemerin-like receptor 1
Ligand
BDBM50517129
Substrate
Meas. Tech.
ChEMBL_1867368 (CHEMBL4368343)
EC50
>10000±n/a nM
Citation
 Imaizumi, TKobayashi, AOtsubo, SKomai, MMagara, MOtsubo, N The discovery and optimization of a series of 2-aminobenzoxazole derivatives as ChemR23 inhibitors. Bioorg Med Chem 27:0 (2019)  
Target
Name:
Chemerin-like receptor 1
Synonyms:
CHEMR23 CMKLR1 Chemokine-like receptor 1 G-protein coupled receptor ChemR23 | G-protein coupled receptor DEZ
Type:
PROTEIN
Mol. Mass.:
42333.62
Organism:
Homo sapiens (Human)
Description:
ChEMBL_100822
Residue:
373
  
Inhibitor
Name:
BDBM50517129
Synonyms:
CHEMBL4539132
Type:
Small organic molecule
Emp. Form.:
C24H22N6O2
Mol. Mass.:
426.4705
SMILES:
COCCN(Cc1ccc(cc1)-c1ccccc1-c1nnn[nH]1)c1nc2ccccc2o1
: