Target
Mitogen-activated protein kinase 14
Ligand
BDBM50071867
Substrate
Meas. Tech.
ChEBML_124504
IC50
9.0±n/a nM
Citation
 de Laszlo, SEVisco, DAgarwal, LChang, LChin, JCroft, GForsyth, AFletcher, DFrantz, BHacker, CHanlon, WHarper, CKostura, MLi, BLuell, SMacCoss, MMantlo, NO'Neill, EAOrevillo, CPang, MParsons, JRolando, ASahly, YSidler, KO'Keefe, SJ Pyrroles and other heterocycles as inhibitors of p38 kinase. Bioorg Med Chem Lett 8:2689-94 (1999)  
Target
Name:
Mitogen-activated protein kinase 14
Synonyms:
CSAID-binding protein CSBP1 CSPB1 MAP kinase 14 MAP kinase p38 alpha MAPK14 MK14_HUMAN Mitogen-activated protein kinase p38 alpha Stress-activated protein kinase 2a | p38 MAP kinase alpha/beta
Type:
Serine/threonine-protein kinase
Mol. Mass.:
41286.76
Organism:
Homo sapiens (Human)
Description:
Q16539
Residue:
360
  
Inhibitor
Name:
BDBM50071867
Synonyms:
4-[2-(4-Fluoro-phenyl)-5-(4-methanesulfonyl-phenyl)-1H-pyrrol-3-yl]-pyridine | CHEMBL316275
Type:
Small organic molecule
Emp. Form.:
C22H17FN2O2S
Mol. Mass.:
392.446
SMILES:
CS(=O)(=O)c1ccc(cc1)-c1cc(c([nH]1)-c1ccc(F)cc1)-c1ccncc1
: