Target
Mitogen-activated protein kinase 14
Ligand
BDBM50071884
Substrate
Meas. Tech.
ChEBML_148191
IC50
4.4±n/a nM
Citation
 de Laszlo, SEVisco, DAgarwal, LChang, LChin, JCroft, GForsyth, AFletcher, DFrantz, BHacker, CHanlon, WHarper, CKostura, MLi, BLuell, SMacCoss, MMantlo, NO'Neill, EAOrevillo, CPang, MParsons, JRolando, ASahly, YSidler, KO'Keefe, SJ Pyrroles and other heterocycles as inhibitors of p38 kinase. Bioorg Med Chem Lett 8:2689-94 (1999)  
Target
Name:
Mitogen-activated protein kinase 14
Synonyms:
Csbp1 MAP kinase p38 alpha Mapk14
Type:
PROTEIN
Mol. Mass.:
41315.23
Organism:
Rattus norvegicus
Description:
ChEMBL_148191
Residue:
360
  
Inhibitor
Name:
BDBM50071884
Synonyms:
4-[2-(3,4-Difluoro-phenyl)-5-phenyl-1H-pyrrol-3-yl]-pyridine | CHEMBL91630
Type:
Small organic molecule
Emp. Form.:
C21H14F2N2
Mol. Mass.:
332.3461
SMILES:
Fc1ccc(cc1F)-c1[nH]c(cc1-c1ccncc1)-c1ccccc1
: