Target
Progesterone receptor
Ligand
BDBM50072024
Substrate
Meas. Tech.
ChEMBL_159728 (CHEMBL766185)
Ki
1.1±n/a nM
Citation
 Hamann, LGWinn, DTPooley, CLTegley, CMWest, SJFarmer, LJZhi, LEdwards, JPMarschke, KBMais, DEGoldman, MEJones, TK Nonsteroidal progesterone receptor antagonists based on a conformationally-restricted subseries of 6-aryl-1,2-dihydro-2,2,4-trimethylquinolines. Bioorg Med Chem Lett 8:2731-6 (1999)  
Target
Name:
Progesterone receptor
Synonyms:
NR3C3 PGR PRGR_HUMAN | progesterone
Type:
Protein
Mol. Mass.:
98979.52
Organism:
Homo sapiens (Human)
Description:
P06401
Residue:
933
  
Inhibitor
Name:
BDBM50072024
Synonyms:
(11R,13S,14S,17S)-11-(4-Dimethylamino-phenyl)-17-hydroxy-13-methyl-17-prop-1-ynyl-1,2,6,7,8,11,12,13,14,15,16,17-dodecahydro-cyclopenta[a]phenanthren-3-one Korlym Mifeprex | Mifepristone
Type:
Small organic molecule
Emp. Form.:
C29H35NO2
Mol. Mass.:
429.5937
SMILES:
[H][C@@]12CC[C@@](O)(C#CC)[C@@]1(C)C[C@@H](C1=C3CCC(=O)C=C3CC[C@@]21[H])c1ccc(cc1)N(C)C
: