Target
Metabotropic glutamate receptor 7
Ligand
BDBM50072170
Substrate
Meas. Tech.
ChEBML_104636
IC50
2600±n/a nM
Citation
 Collado, IEzquerra, JMazón, APedregal, CYruretagoyena, BKingston, AETomlinson, RWright, RAJohnson, BGSchoepp, DD 2,3'-disubstituted-2-(2'-carboxycyclopropyl)glycines as potent and selective antagonists of metabotropic glutamate receptors. Bioorg Med Chem Lett 8:2849-54 (1999)  
Target
Name:
Metabotropic glutamate receptor 7
Synonyms:
GPRC1G GRM7 protein MGLUR7 metabotropic glutamate 7
Type:
Enzyme Catalytic Domain
Mol. Mass.:
102262.98
Organism:
Homo sapiens (Human)
Description:
Q14831
Residue:
915
  
Inhibitor
Name:
BDBM50072170
Synonyms:
(1S,2S,3S)-2-[1-Amino-1-carboxy-2-(9H-xanthen-9-yl)-ethyl]-3-isobutyl-cyclopropanecarboxylic acid | CHEMBL97200
Type:
Small organic molecule
Emp. Form.:
C24H27NO5
Mol. Mass.:
409.4749
SMILES:
CC(C)C[C@@H]1[C@@H]([C@H]1C(N)(CC1c2ccccc2Oc2ccccc12)C(O)=O)C(O)=O
: