Target
Proteasome subunit beta type-10
Ligand
BDBM50517643
Substrate
Meas. Tech.
ChEMBL_1869382 (CHEMBL4370448)
IC50
140±n/a nM
Citation
 Xin, BTHuber, EMde Bruin, GHeinemeyer, WMaurits, EEspinal, CDu, YJanssens, MWeyburne, ESKisselev, AFFlorea, BIDriessen, Cvan der Marel, GAGroll, MOverkleeft, HS Structure-Based Design of Inhibitors Selective for Human Proteasome ?2c or ?2i Subunits. J Med Chem 62:1626-1642 (2019)  
Target
Name:
Proteasome subunit beta type-10
Synonyms:
LMP10 MECL1 Multicatalytic endopeptidase complex subunit MECl-1 PSMB10 Proteasome subunit beta-2i
Type:
PROTEIN
Mol. Mass.:
28940.51
Organism:
Homo sapiens (Human)
Description:
ChEMBL_106197
Residue:
273
  
Inhibitor
Name:
BDBM50517643
Synonyms:
CHEMBL4451682
Type:
Small organic molecule
Emp. Form.:
C30H41N7O5S
Mol. Mass.:
611.755
SMILES:
CC(C)C[C@H](NC(=O)[C@H](Cc1ccccc1)N=[N+]=[N-])C(=O)N[C@@H](C)C(=O)N[C@@H](Cc1ccc(CN)cc1)\C=C\S(C)(=O)=O
: