Target
Serine protease 1
Ligand
BDBM50072285
Substrate
Meas. Tech.
ChEBML_212695
IC50
0.120000±n/a nM
Citation
 Finch, HPegg, NAMcLaren, JLowdon, ABolton, RCoote, SJDyer, UMontana, JGOwen, MRDowle, MBuckley, DRoss, BCCampbell, CDix, CMooney, CMan-Tang, CPatel, C 5,5-trans lactone-containing inhibitors of serine proteases: identification of a novel, acylating thrombin inhibitor. Bioorg Med Chem Lett 8:2955-60 (1999)  
Target
Name:
Serine protease 1
Synonyms:
Alpha-trypsin chain 1 Beta-trypsin PRSS1 TRP1 TRY1_HUMAN Thrombin & trypsin Trypsin I | Trypsin-1
Type:
Enzyme
Mol. Mass.:
26557.80
Organism:
Homo sapiens (Human)
Description:
P07477
Residue:
247
  
Inhibitor
Name:
BDBM50072285
Synonyms:
(3R,3aS,6aS)-3-Phenylsulfanyl-hexahydro-cyclopenta[b]furan-2-one | CHEMBL99622
Type:
Small organic molecule
Emp. Form.:
C13H14O2S
Mol. Mass.:
234.314
SMILES:
O=C1O[C@H]2CCC[C@@H]2[C@H]1Sc1ccccc1
: