Target
Type-1 angiotensin II receptor
Ligand
BDBM50518037
Substrate
Meas. Tech.
ChEMBL_1870351 (CHEMBL4371518)
EC50
17±n/a nM
Citation
 Tan, LYan, WMcCorvy, JDCheng, J Biased Ligands of G Protein-Coupled Receptors (GPCRs): Structure-Functional Selectivity Relationships (SFSRs) and Therapeutic Potential. J Med Chem 61:9841-9878 (2018)  
Target
Name:
Type-1 angiotensin II receptor
Synonyms:
AGTR1 AGTR1B AT1 AT1BR AT2R1B Angiotensin II receptor Type-1 angiotensin II receptor (AT1)
Type:
Protein
Mol. Mass.:
41080.75
Organism:
Homo sapiens (Human)
Description:
P30556
Residue:
359
  
Inhibitor
Name:
BDBM50518037
Synonyms:
CHEMBL4542269
Type:
Small organic molecule
Emp. Form.:
C40H72N14O8
Mol. Mass.:
877.0887
SMILES:
CC[C@H](C)[C@H](NC(=O)[C@@H](NC(=O)[C@H](CCCNC(N)=N)NC(=O)CNC)C(C)C)C(=O)N[C@@H](CCCCN)CN[C@@H](Cc1cnc[nH]1)C(=O)N1CCC[C@H]1C(=O)N[C@H](C)C(O)=O
: