Target
Coagulation factor X
Ligand
BDBM50072448
Substrate
Meas. Tech.
ChEBML_226349
Ki
1.3±n/a nM
Citation
 Fevig, JMCacciola, JAlexander, RSKnabb, RMLam, GNWong, PCWexler, RR Preparation of meta-amidino-N,N-disubstituted anilines as potent inhibitors of coagulation factor Xa. Bioorg Med Chem Lett 8:3143-8 (1999)  
Target
Name:
Coagulation factor X
Synonyms:
F10 | FA10_RABIT
Type:
PROTEIN
Mol. Mass.:
53951.21
Organism:
Oryctolagus cuniculus
Description:
ChEMBL_1471174
Residue:
490
  
Inhibitor
Name:
BDBM50072448
Synonyms:
CHEMBL18767 | {(3-Carbamimidoyl-phenyl)-[3-(2'-sulfamoyl-biphenyl-4-yl)-propyl]-amino}-acetic acid methyl ester; TFA
Type:
Small organic molecule
Emp. Form.:
C25H28N4O4S
Mol. Mass.:
480.579
SMILES:
COC(=O)CN(CCCc1ccc(cc1)-c1ccccc1S(N)(=O)=O)c1cccc(c1)C(N)=N
: